Sort Score
Result 10 results
Languages All
Labels All
Results 41 - 50 of 1,912 for

error correction

(0.28 sec)
  1. Aspose.Pdf.Comparison.SideBySidePdfComparer Err...

    Sometime when adding multiple ‘ExcludeAreas’ the Compare methode is running into an Error: Index was out of range. Must be non-negative and less than the size of the collection. (Parameter ‘index’) …...SideBySidePdfCompare Error: Index was out of range Aspose...methode is running into an error: Index was out of range. Must...

    forum.aspose.com/t/aspose-pdf-comparison-sideby...
  2. Timeout error occurred during PDF creation - Fr...

    The PDF generation process that had been running since 10:30 PM on June 29, 2026, stopped, and a timeout Error occurred shortly after 7:00 AM on the 30th. Did any issues arise last night?...Timeout error occurred during PDF creation Aspose.PDF Product...2026, stopped, and a timeout error occurred shortly after 7:00...

    forum.aspose.com/t/timeout-error-occurred-durin...
  3. HTML to PDF, special character error - Free Sup...

    Hello, if we converting the attached files to PDF, the Character “§” is not visible in the attached PDF. Probably an encoding issue because ASCII is used in this case. I’ve tried other encodings as well, with no succes…...HTML to PDF, special character error Aspose.Words Product Family...HTML is not read with the correct encoding, or the font used...

    forum.aspose.com/t/html-to-pdf-special-characte...
  4. Issue running Aspose.word from SSRS report prev...

    Hi, I installed aspose.word to evaluate whether it does what we need. However when I run it in preview mode in SSRS, i get the following Error: An Error occurred during local report processing. Could not load file or …...word from SSRS report preview, error Aspose.Words Product Family...SSRS, i get the following error: An error occurred during local report...

    forum.aspose.com/t/issue-running-aspose-word-fr...
  5. AsposeBadServerResponseException 404 Error When...

    Hi, we update our aspose library to your last version: <dependency> <groupId>com.aspose</groupId> <artifactId>aspose-total</artifactId> <version>25.8</version> <ty…...AsposeBadServerRespo 404 Error When Sending Emails Aspose.Email...AsposeBadServerRespo: Server error [404] Operation failed.: 404/Not...

    forum.aspose.com/t/asposebadserverresponseexcep...
  6. Aspose Error when trying to sign document - Fre...

    Aspose _ result:: Error 405 HTTP method POST is not supported by this URL HTTP Error 405 HTTP method POST is not supported by this URL URI:/api/v2/ProcessCourtFiles STATUS:405 MESSAGE:HTTP method POST is not support…...Aspose Error when trying to sign document Aspose.Total Product...7:57am 1 Aspose _ result:: Error 405 HTTP method POST is not...

    forum.aspose.com/t/aspose-error-when-trying-to-...
  7. PST | Not able to convert .ics file to PST gett...

    Not able to convert .ics file to PST format using aspose lib getting below Error. C:\Users\Tejas>python calendarissue.py Traceback (most recent call last): File “mailissue.py”, line 57, in run() File “mailissue.py”,…...file to PST getting error | Proxy error(UriFormatException):...using aspose lib getting below error. C:\Users\Tejas>python calendarissue...

    forum.aspose.com/t/pst-not-able-to-convert-ics-...
  8. Using excel splitter, keep showing error 502 - ...

    using excel splitter, keep showing Error 502 , how to correct...excel splitter, keep showing error 502 中文技术支持 alvin_chan April...splitter, keep showing error 502 , how to correct Professionalize.Discourse...

    forum.aspose.com/t/using-excel-splitter-keep-sh...
  9. Error converting file to PDF/A-1 format - Free ...

    Hi Aspose.PDF.Drawing Version=“24.2.0” Aspose.Imaging Version=“24.2.0” I’m converting a PDF file file.pdf (34.5 KB) to PDF/A-1 format, but I’m getting an Error: System.TypeLoadException: Could not load type 'Aspose.I…...Error converting file to PDF/A-1 format Aspose.PDF Product Family...format, but I’m getting an error: System.TypeLoadException: Could...

    forum.aspose.com/t/error-converting-file-to-pdf...
  10. Calling AsposeOCR.Recognize get error with Micr...

    I use AsposeOCR to recognize text in pdf file. On localhost, all is ok. On server web (in production), I have an Error with Microsoft.ML.OnnxRuntime: The type initializer for ‘Microsoft.ML.OnnxRuntime.NativeMethods’ t…...Recognize get error with Microsoft.ML.OnnxRuntime...(in production), I have an error with Microsoft.ML.OnnxRuntime:...

    forum.aspose.com/t/calling-asposeocr-recognize-...